Target
Acid phosphatase
Ligand
BDBM50090256
Substrate
Meas. Tech.
Inhibitor Screening Assay
Ki
3.80e+5± 1.60e+5 nM
Citation
 McRae, SPagliai, FAMohapatra, NPGener, AMahmou, ASGunn, JSLorca, GLGonzalez, CF Inhibition of AcpA phosphatase activity with ascorbate attenuates Francisella tularensis intramacrophage survival. J Biol Chem 285:5171-7 (2010)  
Target
Name:
Acid phosphatase
Synonyms:
Acid phosphatase (acpA) Acid phosphatase (acpC)
Type:
Enzyme
Mol. Mass.:
22350.38
Organism:
Francisella tularensis
Description:
Q5NIC0
Residue:
194
  
Inhibitor
Name:
BDBM50090256
Synonyms:
(R)-2-((S)-1,2-dihydroxyethyl)-4,5-dihydroxyfuran-3(2H)-one (R)-5-((S)-1,2-dihydroxyethyl)-3,4-dihydroxyfuran-2(5H)-one CHEMBL196 vitamin C
Type:
Small organic molecule
Emp. Form.:
C6H8O6
Mol. Mass.:
176.1241
SMILES:
OC[C@H](O)c1oc(O)c(O)c1O
: