Target
Methyl-accepting chemotaxis protein NahY
Ligand
BDBM23230
Substrate
Meas. Tech.
Isothermal Titration Calorimetry
Temperature
293.15±0 K
Kd
2.39e+4±n/a nM
Citation
 Lacal, JAlfonso, CLiu, XParales, REMorel, BConejero-Lara, FRivas, GDuque, ERamos, JLKrell, T Identification of a chemoreceptor for tricarboxylic acid cycle intermediates: differential chemotactic response towards receptor ligands. J Biol Chem 285:23126-36 (2010)  
Target
Name:
Methyl-accepting chemotaxis protein NahY
Synonyms:
Methyl-accepting chemotaxis protein (McpS) nahY
Type:
Protein
Mol. Mass.:
58698.14
Organism:
Pseudomonas putida (Arthrobacter siderocapsulatus)
Description:
Q9Z429
Residue:
538
  
Inhibitor
Name:
BDBM23230
Synonyms:
2-Oxosuccinic acid Oxaloacetate keto-Oxaloacetate
Type:
Small organic molecule
Emp. Form.:
C4H4O5
Mol. Mass.:
132.0716
SMILES:
OC(=O)CC(=O)C(O)=O
: