Target
Cytochrome P450 2E1
Ligand
BDBM92497
Substrate
Meas. Tech.
Binding Assay
Kd
2.1e+4±n/a nM
Citation
 Porubsky, PRBattaile, KPScott, EE Human cytochrome P450 2E1 structures with fatty acid analogs reveal a previously unobserved binding mode. J Biol Chem 285:22282-90 (2010)  
Target
Name:
Cytochrome P450 2E1
Synonyms:
CP2E1_HUMAN CYP2E1 | Cytochrome P450 2E1 (CYP2E1)
Type:
Enzyme
Mol. Mass.:
56860.34
Organism:
Homo sapiens (Human)
Description:
P05181
Residue:
493
  
Inhibitor
Name:
BDBM92497
Synonyms:
CHEMBL542051 | Omega-imidazolyl octanoic acid
Type:
Fatty acid
Emp. Form.:
C11H18N2O2
Mol. Mass.:
210.2728
SMILES:
OC(=O)CCCCCCCn1ccnc1
: