Target
Stromelysin-2
Ligand
BDBM92443
Substrate
Meas. Tech.
Enzyme Assay
pH
6.8±0
Temperature
298.15±0 K
Ki
872±0.0 nM
Citation
 Devel, LGarcia, SCzarny, BBeau, FLaJeunesse, EVera, LGeorgiadis, DStura, EDive, V Insights from selective non-phosphinic inhibitors of MMP-12 tailored to fit with an S1' loop canonical conformation. J Biol Chem 285:35900-9 (2010)  
Target
Name:
Stromelysin-2
Synonyms:
MMP10 Matrix Metalloproteinase-10 (MMP-10) STMY2
Type:
Enzyme
Mol. Mass.:
54143.02
Organism:
Homo sapiens (Human)
Description:
P09238
Residue:
476
  
Inhibitor
Name:
BDBM92443
Synonyms:
MMP Inhibitor, 3 US8691753, 97
Type:
Small molecule
Emp. Form.:
C29H31N3O7S
Mol. Mass.:
565.637
SMILES:
NC(=O)[C@@H](CCC(O)=O)NC(=O)[C@H](CCC(O)=O)NC(=O)CCc1ccc(cc1)-c1cc(cs1)-c1ccccc1
: