Target
Steroid C26-monooxygenase
Ligand
BDBM92505
Substrate
Meas. Tech.
Binding Assay
Kd
1.2e+3± 1e+2 nM
Citation
 Driscoll, MDMcLean, KJLevy, CMast, NPikuleva, IALafite, PRigby, SELeys, DMunro, AW Structural and biochemical characterization of Mycobacterium tuberculosis CYP142: evidence for multiple cholesterol 27-hydroxylase activities in a human pathogen. J Biol Chem 285:38270-82 (2010)  
Target
Name:
Steroid C26-monooxygenase
Synonyms:
CP125_MYCTO Cytochrome P450 125 (CYP125) cyp125 | cyp125A1
Type:
Enzyme
Mol. Mass.:
48425.01
Organism:
Mycobacterium tuberculosis
Description:
P9WPP0
Residue:
433
  
Inhibitor
Name:
BDBM92505
Synonyms:
4-Cholesten-3-one | Steroid scaffold, 14
Type:
Organic molecule
Emp. Form.:
C27H44O
Mol. Mass.:
384.6377
SMILES:
CC(C)CCC[C@@H](C)[C@H]1CC[C@H]2[C@@H]3CCC4=CC(=O)CC[C@]4(C)[C@H]3CC[C@]12C
: