Target
Macrophage migration inhibitory factor
Ligand
BDBM92506
Substrate
BDBM92519
Meas. Tech.
Tautomerase Enzyme Assay
pH
6.5±0
Ki
8.6e+2±n/a nM
IC50
2.45e+3±n/a nM
Citation
 Ouertatani-Sakouhi, HEl-Turk, FFauvet, BCho, MKPinar Karpinar, DLe Roy, DDewor, MRoger, TBernhagen, JCalandra, TZweckstetter, MLashuel, HA Identification and characterization of novel classes of macrophage migration inhibitory factor (MIF) inhibitors with distinct mechanisms of action. J Biol Chem 285:26581-98 (2010)  
Target
Name:
Macrophage migration inhibitory factor
Synonyms:
GIF Glycosylation-inhibiting factor L-dopachrome tautomerase MIF/CD74 (Macrophage migration inhibitory factor and HLA-DR antigens-associated invariant chain) MMIF Macrophage migration inhibitory factor (MIF) | Phenylpyruvate tautomerase
Type:
Enzyme
Mol. Mass.:
12478.18
Organism:
Homo sapiens (Human)
Description:
P14174
Residue:
115
  
Inhibitor
Name:
BDBM92506
Synonyms:
BTB 09588, 1
Type:
Small organic molecule
Emp. Form.:
C11H7N3O6S
Mol. Mass.:
309.255
SMILES:
[O-][N+](=O)c1ccc(ONC(=O)c2cccs2)c(c1)[N+]([O-])=O
:
Substrate
Name:
BDBM92519
Synonyms:
D-Dopachrome
Type:
Substrate
Emp. Form.:
C9H7NO4
Mol. Mass.:
193.1562
SMILES:
OC(=O)[C@H]1CC2=CC(=O)C(=O)CC2=N1
: