Target
Mitogen-activated protein kinase 10
Ligand
BDBM92529
Substrate
Meas. Tech.
Fluorescence Assay
pH
7±0
Temperature
295.15±0 K
IC50
2.1e+3±n/a nM
Citation
 Kamenecka, THabel, JDuckett, DChen, WLing, YYFrackowiak, BJiang, RShin, YSong, XLoGrasso, P Structure-activity relationships and X-ray structures describing the selectivity of aminopyrazole inhibitors for c-Jun N-terminal kinase 3 (JNK3) over p38. J Biol Chem 284:12853-61 (2009)  
Target
Name:
Mitogen-activated protein kinase 10
Synonyms:
JNK3 MAP kinase p49 3F12 MK10_HUMAN Mitogen-activated protein kinase 10 (Stress-activated protein kinase JNK3) (c-Jun N-terminal kinase 3) (MAP kinase p49 3F12) PRKM10 Stress-activated protein kinase JNK3 | c-Jun N-terminal kinase 3 (JNK3)
Type:
Enzyme
Mol. Mass.:
52586.89
Organism:
Homo sapiens (Human)
Description:
Residue:
464
  
Inhibitor
Name:
BDBM92529
Synonyms:
Aminopyrazole inhibitor, 4018
Type:
Small molecule
Emp. Form.:
C24H28N6O3
Mol. Mass.:
448.5175
SMILES:
Cc1cccc(NC(=O)Nc2cnn(c2)-c2cccc(c2)C(=O)NCCN2CCOCC2)c1
: