Target
Mitogen-activated protein kinase 13
Ligand
BDBM92527
Substrate
Meas. Tech.
Fluorescence Assay
pH
7±0
Temperature
295.15±0 K
IC50
>2.0e+4±n/a nM
Citation
 Kamenecka, THabel, JDuckett, DChen, WLing, YYFrackowiak, BJiang, RShin, YSong, XLoGrasso, P Structure-activity relationships and X-ray structures describing the selectivity of aminopyrazole inhibitors for c-Jun N-terminal kinase 3 (JNK3) over p38. J Biol Chem 284:12853-61 (2009)  
Target
Name:
Mitogen-activated protein kinase 13
Synonyms:
MAP kinase p38 delta MK13_HUMAN Mitogen-activated protein kinase 13 (MAPK13) Mitogen-activated protein kinase p38 delta SAPK4 p38 delta/gamma
Type:
Enzyme
Mol. Mass.:
42097.16
Organism:
Homo sapiens (Human)
Description:
O15264
Residue:
365
  
Inhibitor
Name:
BDBM92527
Synonyms:
Aminopyrazole inhibitor, 4642
Type:
Small molecule
Emp. Form.:
C25H24ClN7O2
Mol. Mass.:
489.957
SMILES:
CN(C)c1cc(cc(c1)-n1cc(NC(=O)Nc2ccccc2Cl)cn1)C(=O)Nc1cncc(C)c1
: