Target
Acetylcholinesterase
Ligand
BDBM92553
Substrate
Meas. Tech.
Inhibition Assay
Ki
1.55e+3± 1e+2 nM
Citation
 Raza, RSaeed, AArif, MMahmood, SMuddassar, MRaza, AIqbal, J Synthesis and Biological Evaluation of 3-thiazolocoumarinyl Schiff-base Derivatives as Cholinesterase Inhibitors. Chem Biol Drug Des 80:605-15 (2012)  
Target
Name:
Acetylcholinesterase
Synonyms:
ACES_HUMAN Acetylcholinesterase (AChE) | Acetylcholinesterase (human AChE)
Type:
Enzyme
Mol. Mass.:
67792.70
Organism:
Homo sapiens (Human)
Description:
P22303
Residue:
614
  
Inhibitor
Name:
BDBM92553
Synonyms:
Coumarin analogue, 3k
Type:
Small molecule
Emp. Form.:
C21H17N3O5S
Mol. Mass.:
423.442
SMILES:
COc1cc(CN=Nc2nc(cs2)-c2cc3ccccc3oc2=O)cc(OC)c1O
: