Target
Phosphatidylcholine-sterol acyltransferase
Ligand
BDBM92615
Substrate
Meas. Tech.
Enzyme Assay
pH
7.5±0
Temperature
277.15±0 K
IC50
28±0.0 nM
Citation
 Jauhiainen, MYuan, wGelb, MHDolphin, J Human Plasma Lecithin-Cholesterol Acyltransferase J Biol Chem 264:1963-1967 (1989)   
Target
Name:
Phosphatidylcholine-sterol acyltransferase
Synonyms:
LCAT Lecithin-cholesterol acyltransferase (LCAT) Phospholipid-cholesterol acyltransferase
Type:
Protein
Mol. Mass.:
49573.79
Organism:
Homo sapiens (Human)
Description:
P04180
Residue:
440
  
Inhibitor
Name:
BDBM92615
Synonyms:
Difluoroketone phospholipid analogue, 3
Type:
Emp. Form.:
C34H68F2NO6P
Mol. Mass.:
655.8774
SMILES:
CCCCCCCCCCCCCCCCC(=O)C(F)(F)C(COCCCCCCCC)COP([O-])(=O)OCC[N+](C)(C)C
: