Target
Histone-lysine N-methyltransferase, H3 lysine-79 specific
Ligand
BDBM92648
Substrate
Meas. Tech.
Enzyme Assay
Ki
4±0.0 nM
Citation
 Basavapathruni, AJin, LDaigle, SRMajer, CRTherkelsen, CAWigle, TJKuntz, KWChesworth, RPollock, RMScott, MPMoyer, MPRichon, VMCopeland, RAOlhava, EJ Conformational Adaptation Drives Potent, Selective and Durable Inhibition of the Human Protein Methyltransferase DOT1L. Chem Biol Drug Des 80:971-80 (2012)  
Target
Name:
Histone-lysine N-methyltransferase, H3 lysine-79 specific
Synonyms:
2.1.1.43 DOT1-like protein (Dot1L) DOT1L_HUMAN Histone H3-K79 methyltransferase Histone Methyltransferase DOT1L KIAA1814 Lysine N-methyltransferase 4
Type:
Protein
Mol. Mass.:
184911.91
Organism:
Homo sapiens (Human)
Description:
Q8TEK3
Residue:
1537
  
Inhibitor
Name:
BDBM92648
Synonyms:
EPZ004450
Type:
Organic molecule
Emp. Form.:
C26H37N7O4
Mol. Mass.:
511.6165
SMILES:
CN(CCCNC(=O)Nc1ccc(cc1)C(C)(C)C)CC1OC([C@H](O)[C@@H]1O)n1ccc2c(N)ncnc12
: