Target
Cytochrome P450 2E1
Ligand
BDBM92668
Substrate
Meas. Tech.
Spectral Binding Assay
Kd
1.4e+3±n/a nM
Citation
 Ménard, AFabra, CHuang, YAuclair, K Type II Ligands as Chemical Auxiliaries To Favor Enzymatic Transformations by P450 2E1. Chembiochem 13:2527-36 (2012)  
Target
Name:
Cytochrome P450 2E1
Synonyms:
CP2E1_HUMAN CYP2E1 | Cytochrome P450 2E1 (CYP2E1)
Type:
Enzyme
Mol. Mass.:
56860.34
Organism:
Homo sapiens (Human)
Description:
P05181
Residue:
493
  
Inhibitor
Name:
BDBM92668
Synonyms:
Auxiliary substrate, 1a
Type:
Organic molecule
Emp. Form.:
C12H17NO2
Mol. Mass.:
207.2689
SMILES:
CCCCCCOC(=O)c1cccnc1
: