Target
Prolyl 4-hydroxylase subunit alpha-1
Ligand
BDBM16419
Substrate
Meas. Tech.
Inhibition Assay
Ki
>20000000±0.0 nM
Citation
 Majamaa, KGünzler, VHanauske-Abel, HMMyllylä, RKivirikko, KI Partial identity of the 2-oxoglutarate and ascorbate binding sites of prolyl 4-hydroxylase. J Biol Chem 261:7819-23 (1986) Target
Name:
Prolyl 4-hydroxylase subunit alpha-1
Synonyms:
P4HA P4HA1_CHICK Prolyl 4-hydroxylase subunit alpha-1
Type:
Protein
Mol. Mass.:
59433.79
Organism:
Gallus gallus (Chicken)
Description:
P16924
Residue:
516
  
Inhibitor
Name:
BDBM16419
Synonyms:
2-phenylacetic acid CHEMBL1044 Phenylacetic acid | phenylacetate
Type:
Small organic molecule
Emp. Form.:
C8H8O2
Mol. Mass.:
136.1479
SMILES:
OC(=O)Cc1ccccc1
: