Target
Acyl-protein thioesterase 2
Ligand
BDBM92725
Substrate
Meas. Tech.
Enzymatic Protein Activity Assay
IC50
4.18e+3± 7.7e+2 nM
Citation
 Zimmermann, TJBürger, MTashiro, EKondoh, YMartinez, NEGörmer, KRosin-Steiner, SShimizu, TOzaki, SMikoshiba, KWatanabe, NHall, DVetter, IROsada, HHedberg, CWaldmann, H Boron-based inhibitors of acyl protein thioesterases 1 and 2. Chembiochem 14:115-22 (2013)  
Target
Name:
Acyl-protein thioesterase 2
Synonyms:
APT2 LYPA2_HUMAN Lysophospholipase II
Type:
Protein
Mol. Mass.:
24740.23
Organism:
Homo sapiens (Human)
Description:
O95372
Residue:
231
  
Inhibitor
Name:
BDBM92725
Synonyms:
Phenylboronic acid, 18
Type:
Small molecule
Emp. Form.:
C6H6BClO2
Mol. Mass.:
156.375
SMILES:
OB(O)c1ccc(Cl)cc1
: