Target
DNA-(apurinic or apyrimidinic site) endonuclease
Ligand
BDBM92740
Substrate
Meas. Tech.
Molecular Beacon Assay
Ki
4.90e+3±n/a nM
Citation
 Srinivasan, AWang, LCline, CJXie, ZSobol, RWXie, XQGold, B Identification and characterization of human apurinic/apyrimidinic endonuclease-1 inhibitors. Biochemistry 51:6246-59 (2012)  
Target
Name:
DNA-(apurinic or apyrimidinic site) endonuclease
Synonyms:
APE APEX APEX1_HUMAN Apurinic-apyrimidinic endonuclease 1 (APE-1) DNA-(apurinic or apyrimidinic site) lyase REF1
Type:
Protein
Mol. Mass.:
35560.12
Organism:
Homo sapiens (Human)
Description:
P27695
Residue:
318
  
Inhibitor
Name:
BDBM92740
Synonyms:
NSC614430, 13
Type:
Small molecule
Emp. Form.:
C20H14N8O6
Mol. Mass.:
462.3752
SMILES:
Nc1nnc2nc(CC(=O)c3ccccc3[N+]([O-])=O)c(CC(=O)c3ccccc3[N+]([O-])=O)nn12
: