Target
Sodium-dependent noradrenaline transporter
Ligand
BDBM202585
Substrate
Meas. Tech.
In Vitro Pharmacology Assay
Ki
11.0±n/a nM
Citation
 Bhat, LAdiey, KBhat, SR Compositions, synthesis, and methods of using phenylcycloalkylmethylamine derivatives US Patent  US10035761 Publication Date 7/31/2018 
Target
Name:
Sodium-dependent noradrenaline transporter
Synonyms:
Monoamine transporter NET Noradrenaline Transporter (NET) Norepinephrine transporter protein (NET) SLC6A2 Sodium-dependent noradrenaline transporter (NET) | Solute carrier family 6 member 2
Type:
Multi-pass membrane protein
Mol. Mass.:
69337.72
Organism:
Homo sapiens (Human)
Description:
P23975
Residue:
617
  
Inhibitor
Name:
BDBM202585
Synonyms:
US10035761, Compound 8j | US9238625, 8j
Type:
Small organic molecule
Emp. Form.:
C21H33Cl2NO
Mol. Mass.:
386.399
SMILES:
CCOCCCCN[C@H](CC(C)C)C1(CCC1)c1ccc(Cl)c(Cl)c1
: