Target
Peptide deformylase
Ligand
BDBM92762
Substrate
Meas. Tech.
Binding Assay
Ki
25910±0.0 nM
Citation
 Totoritis, RDuraiswami, CTaylor, ANKerrigan, JJCampobasso, NSmith, KJWard, PKing, BWMurrayz-Thompson, MJones, ADVan Aller, GSAubart, KMZalacain, MThrall, SHMeek, TDSchwartz, B Understanding the origins of time-dependent inhibition by polypeptide deformylase inhibitors. Biochemistry 50:6642-54 (2011)  
Target
Name:
Peptide deformylase
Synonyms:
DEF_STRR6 Polypeptide Deformylase def
Type:
Enzyme
Mol. Mass.:
22684.24
Organism:
Streptococcus pneumoniae (strain ATCC BAA-255 / R6)
Description:
The pdf gene from S. pneumoniae was cloned and protein was expressed and purified from E. coli BL21(DE3).
Residue:
203
  
Inhibitor
Name:
BDBM92762
Synonyms:
PDF inhibitor, compound 4
Type:
Small molecule
Emp. Form.:
C11H11Cl2NO3
Mol. Mass.:
276.116
SMILES:
OC(CCNC(=O)c1cccc(Cl)c1Cl)C=O
: