Target
Cytochrome P450
Ligand
BDBM92785
Substrate
Meas. Tech.
Enzyme Inhibition Assay
Kd
2.05e+5± 2.5e+4 nM
Citation
 Goyal, SBanerjee, SMazumdar, S Oxygenation of monoenoic fatty acids by CYP175A1, an orphan cytochrome P450 from Thermus thermophilus HB27. Biochemistry 51:7880-90 (2012)  
Target
Name:
Cytochrome P450
Synonyms:
Type:
Protein
Mol. Mass.:
44267.85
Organism:
Thermus thermophilus
Description:
Q746J6
Residue:
389
  
Inhibitor
Name:
BDBM92785
Synonyms:
Cis-vaccenic acid, 18C11
Type:
Organic molecule
Emp. Form.:
C16H30O2
Mol. Mass.:
254.4082
SMILES:
CCCCC\C=C\CCCCCCCCC(O)=O
: