Target
Nociceptin receptor
Ligand
BDBM92848
Substrate
Ki
358±n/a nM
Comments
PDSP_1278
Citation
 Mogil, JSPasternak, GW The molecular and behavioral pharmacology of the orphanin FQ/nociceptin peptide and receptor family. Pharmacol Rev 53:381-415 (2001) Target
Name:
Nociceptin receptor
Synonyms:
K3 opiate receptor Kappa-type 3 opioid receptor Nociceptin/Orphanin FQ, NOP receptor ORGC Oprl Orphanin FQ receptor
Type:
Enzyme Catalytic Domain
Mol. Mass.:
40499.09
Organism:
MOUSE
Description:
Nociceptin/Orphanin FQ, NOP receptor 0 MOUSE::P35377
Residue:
367
  
Inhibitor
Name:
BDBM92848
Synonyms:
CAS_122266 NSC_122266
Type:
Small organic molecule
Emp. Form.:
C26H27N3O4
Mol. Mass.:
445.5103
SMILES:
Oc1ccc2CC3N(CC=C)CCC45C(Oc1c24)C(CCC35O)=NNC(=O)c1ccccc1
: