Target
Nitric oxide synthase, endothelial
Ligand
BDBM50341679
Substrate
Meas. Tech.
Inhibitory Assay
Ki
20000±0.0 nM
Citation
 Delker, SLXue, FLi, HJamal, JSilverman, RBPoulos, TL Role of zinc in isoform-selective inhibitor binding to neuronal nitric oxide synthase . Biochemistry 49:10803-10 (2010)  
Target
Name:
Nitric oxide synthase, endothelial
Synonyms:
Constitutive NOS Endothelial NOS NOS type III NOS3_HUMAN Nitric oxide synthase (inducible and endothelial) Nitric-oxide synthase (endothelial and brain) eNOS
Type:
Enzyme Catalytic Domain
Mol. Mass.:
133297.84
Organism:
Homo sapiens (Human)
Description:
P29474
Residue:
1203
  
Inhibitor
Name:
BDBM50341679
Synonyms:
4-(2-(6-(2-(6-Amino-4-methylpyridin-2-yl)ethyl)pyridin-2-yl)ethyl)-6-methylpyridin-2-amine CHEMBL1615291 | NOS Inhibitor, 3m
Type:
Small organic molecule
Emp. Form.:
C21H25N5
Mol. Mass.:
347.4567
SMILES:
Cc1cc(N)nc(CCc2cccc(CCc3cc(C)nc(N)c3)n2)c1
: