Target
Nitric oxide synthase, inducible
Ligand
BDBM50341681
Substrate
Meas. Tech.
Inhibitory Assay
Ki
1910±0.0 nM
Citation
 Delker, SLXue, FLi, HJamal, JSilverman, RBPoulos, TL Role of zinc in isoform-selective inhibitor binding to neuronal nitric oxide synthase . Biochemistry 49:10803-10 (2010)  
Target
Name:
Nitric oxide synthase, inducible
Synonyms:
HEP-NOS Inducible NO synthase NOS type II NOS2A Nitric oxide synthase, inducible (iNOS) | iNOS
Type:
Homodimer
Mol. Mass.:
131141.95
Organism:
Homo sapiens (Human)
Description:
P35228
Residue:
1153
  
Inhibitor
Name:
BDBM50341681
Synonyms:
4-(2-(5-(2-(6-Amino-4-methylpyridin-2-yl)ethyl)pyridin-3-yl)ethyl)-6-methylpyridin-2-amine CHEMBL1615289 | NOS Inhibitor, 3k
Type:
Small organic molecule
Emp. Form.:
C21H25N5
Mol. Mass.:
347.4567
SMILES:
Cc1cc(N)nc(CCc2cncc(CCc3cc(C)nc(N)c3)c2)c1
: