Target
AP2-associated protein kinase 1
Ligand
BDBM279479
Substrate
Meas. Tech.
AAK1 Kinase Assay
pH
7.4±n/a
Temperature
298.15±n/a K
IC50
12.0±n/a nM
Comments
extracted
Citation
 Dzierba, CDBronson, JJMacor, JEDasgupta, BNara, SJVrudhula, VMPan, SHartz, RARajamani, R Heterocyclic kinase inhibitors US Patent  US10035777 Publication Date 7/31/2018 
Target
Name:
AP2-associated protein kinase 1
Synonyms:
AAK1 Adaptor-associated kinase 1 | KIAA1048
Type:
PROTEIN
Mol. Mass.:
103884.23
Organism:
Homo sapiens (Human)
Description:
ChEMBL_774569
Residue:
961
  
Inhibitor
Name:
BDBM279479
Synonyms:
(R)-1-(5-methoxy-6-(oxazol-5-yl)-1H-benzo[d]imidazol-2-yl)-3-methylbutan-1-amine | US10035777, Example 29
Type:
Small organic molecule
Emp. Form.:
C23H27N3O3
Mol. Mass.:
393.4788
SMILES:
COc1cc2nc([nH]c2cc1C=C)[C@@H](CC(C)C)NC(=O)OCc1ccccc1
: