Target
AP2-associated protein kinase 1
Ligand
BDBM279548
Substrate
Meas. Tech.
AAK1 Kinase Assay
pH
7.4±n/a
Temperature
298.15±n/a K
IC50
44.0±n/a nM
Comments
extracted
Citation
 Dzierba, CDBronson, JJMacor, JEDasgupta, BNara, SJVrudhula, VMPan, SHartz, RARajamani, R Heterocyclic kinase inhibitors US Patent  US10035777 Publication Date 7/31/2018 
Target
Name:
AP2-associated protein kinase 1
Synonyms:
AAK1 Adaptor-associated kinase 1 | KIAA1048
Type:
PROTEIN
Mol. Mass.:
103884.23
Organism:
Homo sapiens (Human)
Description:
ChEMBL_774569
Residue:
961
  
Inhibitor
Name:
BDBM279548
Synonyms:
3-methyl-1-(6-(pyridin-4-yl)benzo[d]thiazol-2-yl)butan-1-amine | US10035777, Example 98
Type:
Small organic molecule
Emp. Form.:
C22H18N4S2
Mol. Mass.:
402.535
SMILES:
Nc1ccc(cc1SSc1cc(ccc1N)-c1ccncc1)-c1ccncc1
: