Target
AP2-associated protein kinase 1
Ligand
BDBM279554
Substrate
Meas. Tech.
AAK1 Kinase Assay
pH
7.4±n/a
Temperature
298.15±n/a K
IC50
381±n/a nM
Comments
extracted
Citation
 Dzierba, CDBronson, JJMacor, JEDasgupta, BNara, SJVrudhula, VMPan, SHartz, RARajamani, R Heterocyclic kinase inhibitors US Patent  US10035777 Publication Date 7/31/2018 
Target
Name:
AP2-associated protein kinase 1
Synonyms:
AAK1 Adaptor-associated kinase 1 | KIAA1048
Type:
PROTEIN
Mol. Mass.:
103884.23
Organism:
Homo sapiens (Human)
Description:
ChEMBL_774569
Residue:
961
  
Inhibitor
Name:
BDBM279554
Synonyms:
4,4,4-trifluoro-1-(6-(oxazol-5-yl)-1H-benzo[d]imidazol-2-yl)-3-(trifluoromethyl)butan-1-amine | US10035777, Example 104
Type:
Small organic molecule
Emp. Form.:
C15H12F6N4O
Mol. Mass.:
378.2724
SMILES:
NC(CC(C(F)(F)F)C(F)(F)F)c1nc2ccc(cc2[nH]1)-c1cnco1
: