Target
Acetylcholine-binding protein
Ligand
BDBM50143314
Substrate
Meas. Tech.
Interaction Assay
pH
7.4±0
Temperature
298.15±0 K
Kd
0.0835±0.0303 nM
Citation
 Geitmann, MRetra, Kde Kloe, GEHoman, ESmit, ABde Esch, IJDanielson, UH Interaction kinetic and structural dynamic analysis of ligand binding to acetylcholine-binding protein. Biochemistry 49:8143-54 (2010)  
Target
Name:
Acetylcholine-binding protein
Synonyms:
ACHP_LYMST Acetylcholine Binding protein Acetylcholine-binding protein (Ls-AchBP) | AchBP
Type:
Mol. Mass.:
26055.52
Organism:
Lymnaea stagnalis
Description:
Soluble acetylcholine receptor
Residue:
229
  
Inhibitor
Name:
BDBM50143314
Synonyms:
(+)-Epibatidine (1R,2R,4S)-2-(6-Chloro-pyridin-3-yl)-7-aza-bicyclo[2.2.1]heptane CHEMBL298826 | EPIBATIDINE
Type:
Small organic molecule
Emp. Form.:
C11H13ClN2
Mol. Mass.:
208.687
SMILES:
Clc1ccc(cn1)[C@H]1C[C@@H]2CC[C@H]1N2
: