Target
Acetylcholine-binding protein
Ligand
BDBM82070
Substrate
Meas. Tech.
Interaction Assay
pH
7.4±0
Temperature
298.15±0 K
Kd
310±61 nM
Citation
 Geitmann, MRetra, Kde Kloe, GEHoman, ESmit, ABde Esch, IJDanielson, UH Interaction kinetic and structural dynamic analysis of ligand binding to acetylcholine-binding protein. Biochemistry 49:8143-54 (2010)  
Target
Name:
Acetylcholine-binding protein
Synonyms:
ACHP_LYMST Acetylcholine Binding protein Acetylcholine-binding protein (Ls-AchBP) | AchBP
Type:
Mol. Mass.:
26055.52
Organism:
Lymnaea stagnalis
Description:
Soluble acetylcholine receptor
Residue:
229
  
Inhibitor
Name:
BDBM82070
Synonyms:
CAS_29790-52-1 Nicotine-D salicylate US9303017, Nicotine
Type:
Emp. Form.:
C10H14N2
Mol. Mass.:
162.2316
SMILES:
CN1CCC[C@H]1c1cccnc1
: