Target
Dihydrolipoyl dehydrogenase
Ligand
BDBM92887
Substrate
Meas. Tech.
Enzymatic Assay
IC50
9e+2±n/a nM
Citation
 Bryk, RArango, NVenugopal, AWarren, JDPark, YHPatel, MSLima, CDNathan, C Triazaspirodimethoxybenzoyls as selective inhibitors of mycobacterial lipoamide dehydrogenase . Biochemistry 49:1616-27 (2010)  
Target
Name:
Dihydrolipoyl dehydrogenase
Synonyms:
Component of peroxynitrite reductase/peroxidase complex Dihydrolipoyl dehydrogenase (Lpd) Dihydrolipoyl dehydrogenase (Lpd) A290R Dihydrolipoyl dehydrogenase (Lpd) G312A, L313G, L314P, Q315M Dihydrolipoyl dehydrogenase (Lpd) N209V Dihydrolipoyl dehydrogenase (Lpd) R347S lpd | lpdC
Type:
Enzyme
Mol. Mass.:
49231.98
Organism:
Mycobacterium tuberculosis
Description:
P9WHH8
Residue:
464
  
Inhibitor
Name:
BDBM92887
Synonyms:
Triazaspirobenzyl, 5
Type:
Small molecule
Emp. Form.:
C32H34Cl2N4O5
Mol. Mass.:
625.542
SMILES:
COc1ccc(C(=O)N2CCC3(CC2)N(CN(CC(=O)NCCc2ccc(Cl)cc2Cl)C3=O)c2ccccc2)c(OC)c1
: