Target
Integrin alpha-V/beta-1
Ligand
BDBM279561
Substrate
Meas. Tech.
Solid Phase Receptor Assay (SPRA) for alphaVbeta1
pH
7.4±n/a
Temperature
298.15±n/a K
IC50
2.00±n/a nM
Comments
extracted
Citation
 Ruminski, PGGriggs, DW Meta-azacyclic amino benzoic acid derivatives as pan integrin antagonists US Patent  US10035778 Publication Date 7/31/2018 
Target
Name:
Integrin alpha-V/beta-1
Synonyms:
Fibronectin receptor beta/Vitronectin receptor alpha Integrin alpha-V/beta-1
Type:
Enzyme
Mol. Mass.:
Description:
Components:
This complex has 2 components.
Component 1
Name:
Integrin alpha-V
Synonyms:
ITAV_HUMAN Integrin alpha-V/alpha-5 VNRA Vitronectin receptor | Vitronectin receptor subunit alpha
Type:
PROTEIN
Mol. Mass.:
116024.92
Organism:
Homo sapiens (Human)
Description:
ChEMBL_582336
Residue:
1048
  
Component 2
Name:
Integrin beta-1
Synonyms:
CD_antigen=CD29 Fibronectin receptor beta GPIIA ITGB1 MDF2 | MSK12
Type:
Enzyme
Mol. Mass.:
88400.38
Organism:
Homo sapiens (Human)
Description:
P05556
Residue:
798
  
Inhibitor
Name:
BDBM279561
Synonyms:
(3S)-3-(3-bromo-5-(trifluoromethyl)phenyl)-3-(2-(3-hydroxy-5-((5-hydroxy-1,4,5,6-tetrahydropyrimidin-2-yl)amino)benzamido)acetamido)propanoic acid US10577330, Example 2
Type:
Small organic molecule
Emp. Form.:
C23H23BrF3N5O6
Mol. Mass.:
602.358
SMILES:
OC1CNC(Nc2cc(O)cc(c2)C(=O)NCC(=O)N[C@@H](CC(O)=O)c2cc(Br)cc(c2)C(F)(F)F)=NC1
: