Target
Integrin alpha-V/beta-8
Ligand
BDBM279566
Substrate
Meas. Tech.
Solid Phase Receptor Assay (SPRA) for alphaVbeta8
pH
7.4±n/a
Temperature
298.15±n/a K
IC50
0.400±n/a nM
Comments
extracted
Citation
 Ruminski, PGGriggs, DW Meta-azacyclic amino benzoic acid derivatives as pan integrin antagonists US Patent  US10035778 Publication Date 7/31/2018 
Target
Name:
Integrin alpha-V/beta-8
Synonyms:
ITGAV/ITGB8 Integrin alpha-V/beta-8 | Integrin alphavbeta8
Type:
Enzyme
Mol. Mass.:
Description:
Components:
This complex has 2 components.
Component 1
Name:
Integrin alpha-V
Synonyms:
ITAV_HUMAN Integrin alpha-V/alpha-5 VNRA Vitronectin receptor | Vitronectin receptor subunit alpha
Type:
PROTEIN
Mol. Mass.:
116024.92
Organism:
Homo sapiens (Human)
Description:
ChEMBL_582336
Residue:
1048
  
Component 2
Name:
Integrin beta-8
Synonyms:
ITB8_HUMAN | ITGB8
Type:
Protein
Mol. Mass.:
85643.68
Organism:
Homo sapiens (Human)
Description:
Residue:
769
  
Inhibitor
Name:
BDBM279566
Synonyms:
(3S)-3-[3-chloro-5-(trifluoromethyl)phenyl]3-[[2-[[5-hydroxy-1,4,5,6-tetrahydropyrimidin-2-yl)amino]pyridine-3-carbonyl]amino]acetyl]amino]propanoic acid US10577330, Example 7
Type:
Small organic molecule
Emp. Form.:
C22H22ClF3N6O5
Mol. Mass.:
542.895
SMILES:
OC1CNC(Nc2cncc(c2)C(=O)NCC(=O)N[C@@H](CC(O)=O)c2cc(Cl)cc(c2)C(F)(F)F)=NC1
: