Target
Purine nucleoside phosphorylase
Ligand
BDBM92927
Substrate
Meas. Tech.
Inhibtion Assay
Kd
0.383±0.006 nM
Citation
 Edwards, AAMason, JMClinch, KTyler, PCEvans, GBSchramm, VL Altered enthalpy-entropy compensation in picomolar transition state analogues of human purine nucleoside phosphorylase. Biochemistry 48:5226-38 (2009)  
Target
Name:
Purine nucleoside phosphorylase
Synonyms:
Inosine phosphorylase NP PNPH_HUMAN | Purine nucleoside phosphorylase (PNPase)
Type:
Enzyme
Mol. Mass.:
32119.53
Organism:
Homo sapiens (Human)
Description:
Residue:
289
  
Inhibitor
Name:
BDBM92927
Synonyms:
Immucillins, 11
Type:
Small molecule
Emp. Form.:
C11H14N4O2
Mol. Mass.:
234.2545
SMILES:
OC1CCN(Cc2c[nH]c3c2nc[nH]c3=O)C1
: