Target
Carbonic anhydrase 2
Ligand
BDBM92939
Substrate
Meas. Tech.
Inhibition Assay
Ki
11.8±1.8 nM
Citation
 Genis, CSippel, KHCase, NCao, WAvvaru, BSTartaglia, LJGovindasamy, LTu, CAgbandje-McKenna, MSilverman, DNRosser, CJMcKenna, R Design of a carbonic anhydrase IX active-site mimic to screen inhibitors for possible anticancer properties. Biochemistry 48:1322-31 (2009)  
Target
Name:
Carbonic anhydrase 2
Synonyms:
CA-II CAC Carbonate dehydratase II Carbonic anhydrase 2 (CA-II) Carbonic anhydrase C Carbonic anhydrase II (CA-II) Carbonic anhydrase II (hCA II) | Carbonic anhydrase isoenzyme II (hCA II)
Type:
Enzyme
Mol. Mass.:
29250.71
Organism:
Homo sapiens (Human)
Description:
P00918
Residue:
260
  
Inhibitor
Name:
BDBM92939
Synonyms:
Methazolamide, MZM
Type:
Small molecule
Emp. Form.:
C6H9N3O3S2
Mol. Mass.:
235.284
SMILES:
CC1N=C(S\C1=N\C(C)=O)S(N)(=O)=O
: