Target
Carbonic anhydrase 9
Ligand
BDBM10875
Substrate
Meas. Tech.
Inhibition Assay
Ki
1.0±0.3 nM
Citation
 Genis, CSippel, KHCase, NCao, WAvvaru, BSTartaglia, LJGovindasamy, LTu, CAgbandje-McKenna, MSilverman, DNRosser, CJMcKenna, R Design of a carbonic anhydrase IX active-site mimic to screen inhibitors for possible anticancer properties. Biochemistry 48:1322-31 (2009)  
Target
Name:
Carbonic anhydrase 9
Synonyms:
CA-IX CAH9_HUMAN Carbonic anhydrase 9 (CA IX) Carbonic anhydrase 9 precursor Carbonic anhydrase IX (CAIX) Carbonic anhydrases; II & IX MN RCC-associated antigen G250
Type:
Enzyme
Mol. Mass.:
49669.03
Organism:
Homo sapiens (Human)
Description:
Catalytic domain of human cloned isozyme was used in the assay
Residue:
459
  
Inhibitor
Name:
BDBM10875
Synonyms:
5-(2-chlorophenyl)-1,3,4-thiadiazole-2-sulfonamide Chlorzolamide, CHL JMC523116 Compound 19 | aromatic/heteroaromatic sulfonamide 20
Type:
Small organic molecule
Emp. Form.:
C8H6ClN3O2S2
Mol. Mass.:
275.735
SMILES:
NS(=O)(=O)c1nnc(s1)-c1ccccc1Cl
: