Target
Bifunctional aspartokinase/homoserine dehydrogenase 1
Ligand
BDBM92988
Substrate
Meas. Tech.
Inhibition Assay
Ki
11000000±3000000 nM
Citation
 Angeles, TSHunsley, JRViola, RE Reversal of enzyme regiospecificity with alternative substrates for aspartokinase I from Escherichia coli. Biochemistry 31:799-805 (1992)  
Target
Name:
Bifunctional aspartokinase/homoserine dehydrogenase 1
Synonyms:
AK1H_ECOLI Bifunctional aspartokinase/homoserine dehydrogenase 1 thrA1 | thrA2
Type:
Protein
Mol. Mass.:
89109.15
Organism:
Escherichia coli
Description:
P00561
Residue:
820
  
Inhibitor
Name:
BDBM92988
Synonyms:
D-aspartate alpha-benzyl ester
Type:
Small molecule
Emp. Form.:
C11H12NO4
Mol. Mass.:
222.2178
SMILES:
N[C@@H](CC([O-])=O)C(=O)OCc1ccccc1
: