Target
Bifunctional aspartokinase/homoserine dehydrogenase 1
Ligand
BDBM92990
Substrate
Meas. Tech.
Inhibition Assay
Ki
23000000±4000000 nM
Citation
 Angeles, TSHunsley, JRViola, RE Reversal of enzyme regiospecificity with alternative substrates for aspartokinase I from Escherichia coli. Biochemistry 31:799-805 (1992)  
Target
Name:
Bifunctional aspartokinase/homoserine dehydrogenase 1
Synonyms:
AK1H_ECOLI Bifunctional aspartokinase/homoserine dehydrogenase 1 thrA1 | thrA2
Type:
Protein
Mol. Mass.:
89109.15
Organism:
Escherichia coli
Description:
P00561
Residue:
820
  
Inhibitor
Name:
BDBM92990
Synonyms:
Aminomalonate
Type:
Small molecule
Emp. Form.:
C3H3NO4
Mol. Mass.:
117.0613
SMILES:
NC(C([O-])=O)C([O-])=O
: