Target
DNA gyrase subunit A
Ligand
BDBM50107009
Substrate
Meas. Tech.
Enzyme Assay
IC50
3.0e+4±n/a nM
Citation
 Karkare, SChung, TTCollin, FMitchenall, LAMcKay, ARGreive, SJMeyer, JJLall, NMaxwell, A The naphthoquinone diospyrin is an inhibitor of DNA gyrase with a novel mechanism of action. J Biol Chem 288:5149-56 (2013)  
Target
Name:
DNA gyrase subunit A
Synonyms:
GYRA_MYCTU gyrA
Type:
Protein
Mol. Mass.:
92261.11
Organism:
Mycobacterium tuberculosis (strain ATCC 25618 / H37Rv)
Description:
P9WG47
Residue:
838
  
Inhibitor
Name:
BDBM50107009
Synonyms:
5-Hydroxy-7-methyl-[1,4]naphthoquinone 7-methyljuglone | CHEMBL430853
Type:
Small organic molecule
Emp. Form.:
C11H8O3
Mol. Mass.:
188.1794
SMILES:
Cc1cc(O)c2C(=O)C=CC(=O)c2c1
: