Target
3-oxoacyl-[acyl-carrier-protein] synthase 1
Ligand
BDBM93048
Substrate
Meas. Tech.
Binding Fluorescence Titrations
pH
8.5±0
Kd
2.56e+4± 5e+2 nM
Citation
 Kapilashrami, KBommineni, GRMachutta, CAKim, PLai, CTSimmerling, CPicart, FTonge, PJ Thiolactomycin-based ß-Ketoacyl-AcpM Synthase A (KasA) Inhibitors: FRAGMENT-BASED INHIBITOR DISCOVERY USING TRANSIENT ONE-DIMENSIONAL NUCLEAR OVERHAUSER EFFECT NMR SPECTROSCOPY. J Biol Chem 288:6045-52 (2013)  
Target
Name:
3-oxoacyl-[acyl-carrier-protein] synthase 1
Synonyms:
β-ketoacyl-ACP synthase I (KasA) Beta-ketoacyl-ACP synthase (KasA) kasA
Type:
Protein
Mol. Mass.:
43305.57
Organism:
Mycobacterium tuberculosis
Description:
P9WQD9
Residue:
416
  
Inhibitor
Name:
BDBM93048
Synonyms:
TLM analog, 5
Type:
Small molecule
Emp. Form.:
C12H14O3S
Mol. Mass.:
238.303
SMILES:
CC(=O)C1C(=O)S[C@](C)(\C=C(/C)C=C)C1=O
: