Target
Heat shock protein HSP 90-alpha
Ligand
BDBM279592
Substrate
Meas. Tech.
fluorescence polarization assay
pH
7.4±n/a
IC50
60±n/a nM
Comments
extracted
Citation
 Chen, SDing, CZYan, XHuang, WHu, GLi, JZhang, XYang, LXu, H Resorcinol derivative as HSP90 inhibitor US Patent  US10035792 Publication Date 7/31/2018 
Target
Name:
Heat shock protein HSP 90-alpha
Synonyms:
HS90A_HUMAN HSP86 HSP90AA1 HSPCA Heat shock 86 kDa Heat shock protein HSP 90-alpha (HSP90) LAP-2 Lipopolysaccharide-associated protein 2 heat shock protein 90kDa alpha (cytosolic), class A member 1 isoform 2
Type:
Molecular Chaperone
Mol. Mass.:
84623.45
Organism:
Homo sapiens (Human)
Description:
P07900
Residue:
732
  
Inhibitor
Name:
BDBM279592
Synonyms:
5-(2,4-dihydroxyl-5-isopropylphenyl)-N-ethyl-4-(9-isopropyl-1,2,3,4-tetrahydro-1,4-epiminonaphth-6-yl)isoxazole-3-carboxamide | US10035792, Example 7
Type:
Small organic molecule
Emp. Form.:
C28H33N3O4
Mol. Mass.:
475.5793
SMILES:
CCNC(=O)c1noc(c1-c1ccc2C3CCC(N3C(C)C)c2c1)-c1cc(C(C)C)c(O)cc1O
: