Target
Heat shock protein HSP 90-alpha
Ligand
BDBM279599
Substrate
Meas. Tech.
fluorescence polarization assay
pH
7.4±n/a
IC50
<20±n/a nM
Comments
extracted
Citation
 Chen, SDing, CZYan, XHuang, WHu, GLi, JZhang, XYang, LXu, H Resorcinol derivative as HSP90 inhibitor US Patent  US10035792 Publication Date 7/31/2018 
Target
Name:
Heat shock protein HSP 90-alpha
Synonyms:
HS90A_HUMAN HSP86 HSP90AA1 HSPCA Heat shock 86 kDa Heat shock protein HSP 90-alpha (HSP90) LAP-2 Lipopolysaccharide-associated protein 2 heat shock protein 90kDa alpha (cytosolic), class A member 1 isoform 2
Type:
Molecular Chaperone
Mol. Mass.:
84623.45
Organism:
Homo sapiens (Human)
Description:
P07900
Residue:
732
  
Inhibitor
Name:
BDBM279599
Synonyms:
5-(2,4-dihydroxyl-5-isopropyl-phenyl)-N-ethyl-4-(2-methyl-1,2,3,3a,4,6a-hexahydrocyclopenta[c]pyrrol-5-yl)isoxazole-3-carboxamide | US10035792, Example 14
Type:
Small organic molecule
Emp. Form.:
C23H29N3O4
Mol. Mass.:
411.4941
SMILES:
CCNC(=O)c1noc(c1C1=CC2CN(C)CC2C1)-c1cc(C(C)C)c(O)cc1O
: