Target
Anthranilate phosphoribosyltransferase
Ligand
BDBM93073
Substrate
Meas. Tech.
Fluoresence-based Assay
Ki
1.5e+3± 1e+2 nM
Citation
 Castell, AShort, FLEvans, GLCookson, TVBulloch, EMJoseph, DDLee, CEParker, EJBaker, ENLott, JS The Substrate Capture Mechanism of Mycobacterium tuberculosis Anthranilate Phosphoribosyltransferase Provides a Mode for Inhibition. Biochemistry 52:1776-1787 (2013)  
Target
Name:
Anthranilate phosphoribosyltransferase
Synonyms:
Anthranilate phosphoribosyltransferase (Mtb-AnPRT) trpD
Type:
Enzyme
Mol. Mass.:
37738.87
Organism:
Mycobacterium tuberculosis
Description:
P9WFX4
Residue:
370
  
Inhibitor
Name:
BDBM93073
Synonyms:
ACS No 172
Type:
Small molecule
Emp. Form.:
C14H9NO4
Mol. Mass.:
255.2267
SMILES:
[O-]C(=O)c1ccccc1Nc1ccccc1C([O-])=O
: