Target
Anthranilate phosphoribosyltransferase
Ligand
BDBM93076
Substrate
Meas. Tech.
Fluoresence-based Assay
Ki
1.8e+4± 2e+3 nM
Citation
 Castell, AShort, FLEvans, GLCookson, TVBulloch, EMJoseph, DDLee, CEParker, EJBaker, ENLott, JS The Substrate Capture Mechanism of Mycobacterium tuberculosis Anthranilate Phosphoribosyltransferase Provides a Mode for Inhibition. Biochemistry 52:1776-1787 (2013)  
Target
Name:
Anthranilate phosphoribosyltransferase
Synonyms:
Anthranilate phosphoribosyltransferase (Mtb-AnPRT) trpD
Type:
Enzyme
Mol. Mass.:
37738.87
Organism:
Mycobacterium tuberculosis
Description:
P9WFX4
Residue:
370
  
Inhibitor
Name:
BDBM93076
Synonyms:
ACS No 174
Type:
Small molecule
Emp. Form.:
C14H11O2
Mol. Mass.:
211.2365
SMILES:
[O-]C(=O)c1ccccc1Cc1ccccc1
: