Target
Glucose-1-phosphate thymidylyltransferase
Ligand
BDBM52313
Substrate
Meas. Tech.
Inhibition Assay
IC50
>6.0e+4±n/a nM
Citation
 Alphey, MSPirrie, LTorrie, LSBoulkeroua, WAGardiner, MSarkar, AMaringer, MOehlmann, WBrenk, RScherman, MSMcNeil, MRejzek, MField, RASingh, MGray, DWestwood, NJNaismith, JH Allosteric competitive inhibitors of the glucose-1-phosphate thymidylyltransferase (RmlA) from Pseudomonas aeruginosa. ACS Chem Biol 8:387-96 (2013)  
Target
Name:
Glucose-1-phosphate thymidylyltransferase
Synonyms:
Glucose-1-phosphate thymidylyltransferase (RmlA)
Type:
Protein
Mol. Mass.:
32451.00
Organism:
Pseudomonas aeruginosa
Description:
Q9HU22
Residue:
293
  
Inhibitor
Name:
BDBM52313
Synonyms:
6-amino-1-benzyl-5-(methylamino)pyrimidine-2,4-dione 6-amino-5-(methylamino)-1-(phenylmethyl)pyrimidine-2,4-dione Analogue of 1a, 12a SMR000151677 | cid_726225
Type:
Small organic molecule
Emp. Form.:
C12H14N4O2
Mol. Mass.:
246.2652
SMILES:
CNc1c(N)n(Cc2ccccc2)c(=O)[nH]c1=O
: