Target
Glucose-1-phosphate thymidylyltransferase
Ligand
BDBM93090
Substrate
Meas. Tech.
Inhibition Assay
IC50
175± 67 nM
Citation
 Alphey, MSPirrie, LTorrie, LSBoulkeroua, WAGardiner, MSarkar, AMaringer, MOehlmann, WBrenk, RScherman, MSMcNeil, MRejzek, MField, RASingh, MGray, DWestwood, NJNaismith, JH Allosteric competitive inhibitors of the glucose-1-phosphate thymidylyltransferase (RmlA) from Pseudomonas aeruginosa. ACS Chem Biol 8:387-96 (2013)  
Target
Name:
Glucose-1-phosphate thymidylyltransferase
Synonyms:
Glucose-1-phosphate thymidylyltransferase (RmlA)
Type:
Protein
Mol. Mass.:
32451.00
Organism:
Pseudomonas aeruginosa
Description:
Q9HU22
Residue:
293
  
Inhibitor
Name:
BDBM93090
Synonyms:
Analogue of 1a, 8j
Type:
Small molecule
Emp. Form.:
C16H22N4O4S
Mol. Mass.:
366.435
SMILES:
CCCCS(=O)(=O)N(C)c1c(N)n(Cc2ccccc2)c(=O)[nH]c1=O
: