Target
Epidermal growth factor receptor
Ligand
BDBM3977
Substrate
poly(E, A, Y)
Meas. Tech.
Kinase Inhibition Assay
IC50
9300±n/a nM
Citation
 Thompson, AMRewcastle, GWTercel, MDobrusin, EMFry, DWKraker, AJDenny, WA Tyrosine kinase inhibitors. 1. Structure-activity relationships for inhibition of epidermal growth factor receptor tyrosine kinase activity by 2,3-dihydro-2-thioxo-1H-indole-3-alkanoic acids and 2,2'-dithiobis(1H-indole-3-alkanoic acids). J Med Chem 36:2459-69 (1993)  
Target
Name:
Epidermal growth factor receptor
Synonyms:
EGF Receptor Substrate EGFR_HUMAN ERBB1 Epidermal Growth Factor Receptor erbB-1 Epidermal growth factor receptor (EGFR) HER1 Proto-oncogene c-ErbB-1 Tyrosine-Protein Kinase ErbB-1
Type:
Receptor Kinase Domain
Mol. Mass.:
134279.59
Organism:
Homo sapiens (Human)
Description:
P00533
Residue:
1210
  
Inhibitor
Name:
BDBM3977
Synonyms:
2,2 -Trithiobis( 1H-indole-3-acetic acid) dithiobis(1H-indole-3-alkanoic acid) deriv. 25
Type:
Small organic molecule
Emp. Form.:
C20H16N2O4S3
Mol. Mass.:
444.547
SMILES:
OC(=O)Cc1c(SSSc2[nH]c3ccccc3c2CC(O)=O)[nH]c2ccccc12
:
Substrate
Name:
poly(E, A, Y)
Synonyms:
Type:
Random Polymer
Mol. Mass.:
358.43
Organism:
Description:
A 6:3:1 random copolymer of glutamate, alanine and tyrosine. 5 uM ATP containing 0.2 uCi of 0.5-3 Ci/mmol 32P labeled ATP.
Residue:
3
NA