Target
cGMP-specific 3',5'-cyclic phosphodiesterase
Ligand
BDBM93134
Substrate
Meas. Tech.
Phosphodiesterase Inhibition Assay
IC50
3.6e+2±n/a nM
Citation
 Abadi, AHLehmann, JPiazza, GAAbdel-Halim, MAli, MSM Synthesis,MolecularModeling, and Biological Evaluation of Novel Tetrahydro-ß-Carboline Hydantoin and Tetrahydro-ß-Carboline Thiohydantoin Derivatives as Phosphodiesterase 5 Inhibitors International Journal of Medicinal Chemistry 2011:1-9 (2011)   
Target
Name:
cGMP-specific 3',5'-cyclic phosphodiesterase
Synonyms:
3',5'-cyclic phosphodiesterase PDE5 PDE5A_HUMAN Phosphodiesterase 5 (PDE5) Phosphodiesterase 5A (PDE5A) cGMP-specific 3',5'-cyclic phosphodiesterase
Type:
Protein
Mol. Mass.:
99975.83
Organism:
Homo sapiens (Human)
Description:
O76074
Residue:
875
  
Inhibitor
Name:
BDBM93134
Synonyms:
PDE5 Inhibitor, 5 | PDE5 Inhibitor, 8
Type:
Small molecule
Emp. Form.:
C23H23N3O4
Mol. Mass.:
405.4464
SMILES:
CCn1c(O)c2Cc3c([nH]c4ccccc34)[C@@H](c3ccc(OC)cc3OC)n2c1=O
: