Target
Cathepsin K
Ligand
BDBM93168
Substrate
Meas. Tech.
Inhibition Assay
pH
5.5±0
Ki
200±0.0 nM
Citation
 Yamashita, DSDong, XOh, HJBrook, CSTomaszek, TASzewczuk, LTew, DGVeber, DF Solid-phase synthesis of a combinatorial array of 1,3-bis(acylamino)-2-butanones, inhibitors of the cysteine proteases cathepsins K and L. J Comb Chem 1:207-15 (1999)  
Target
Name:
Cathepsin K
Synonyms:
CATK_HUMAN CTSO Cathepsin O Cathepsin X
Type:
Enzyme
Mol. Mass.:
36975.68
Organism:
Homo sapiens (Human)
Description:
P43235
Residue:
329
  
Inhibitor
Name:
BDBM93168
Synonyms:
Cathepsin Inhibitor, Column 1 Row 1
Type:
Small molecule
Emp. Form.:
C25H32N4O4
Mol. Mass.:
452.546
SMILES:
CC(C)C[C@H](NC(C)=O)C(=O)NC(C)C(=O)CNC(=O)Cc1cccc(c1)-c1ccccn1
: