Target
Cathepsin B
Ligand
BDBM93175
Substrate
Meas. Tech.
Inhibition Assay
pH
5.5±0
Ki
>1000±0.0 nM
Citation
 Yamashita, DSDong, XOh, HJBrook, CSTomaszek, TASzewczuk, LTew, DGVeber, DF Solid-phase synthesis of a combinatorial array of 1,3-bis(acylamino)-2-butanones, inhibitors of the cysteine proteases cathepsins K and L. J Comb Chem 1:207-15 (1999)  
Target
Name:
Cathepsin B
Synonyms:
APP secretase CATB_HUMAN CTSB Cathepsin B light chain | Cathepsin B1
Type:
Enzyme
Mol. Mass.:
37819.69
Organism:
Homo sapiens (Human)
Description:
gi_63102437
Residue:
339
  
Inhibitor
Name:
BDBM93175
Synonyms:
Cathepsin Inhibitor, Column 3 Row 2
Type:
Small molecule
Emp. Form.:
C35H36N4O6
Mol. Mass.:
608.6835
SMILES:
COc1ccc(cc1OC)C(=O)N[C@@H](Cc1ccccc1)C(=O)NC(C)C(=O)CNC(=O)Cc1cccc(c1)-c1ccccn1
: