Target
Cathepsin B
Ligand
BDBM93201
Substrate
Meas. Tech.
Fluorometric High-Throughput Assay
pH
5.5±0
Ki
111±8 nM
Citation
 Wood, WJHuang, LEllman, JA Synthesis of a diverse library of mechanism-based cysteine protease inhibitors. J Comb Chem 5:869-80 (2003)  
Target
Name:
Cathepsin B
Synonyms:
APP secretase CATB_HUMAN CTSB Cathepsin B light chain | Cathepsin B1
Type:
Enzyme
Mol. Mass.:
37819.69
Organism:
Homo sapiens (Human)
Description:
gi_63102437
Residue:
339
  
Inhibitor
Name:
BDBM93201
Synonyms:
Mercaptomethyl ketone Inhibitor, 50
Type:
Small molecule
Emp. Form.:
C28H39N3O4S
Mol. Mass.:
513.692
SMILES:
CC(C)C[C@H](NC(=O)OCc1ccccc1)C(=O)N[C@@H](CCCCN)C(=O)CSCc1ccccc1
: