Target
Isocitrate dehydrogenase [NADP] cytoplasmic [R132H]
Ligand
BDBM279663
Substrate
Meas. Tech.
Inhibition of Cellular Release of Amyloid Peptide 1-40
IC50
640±n/a nM
Citation
 Badiger, SChebrolu, MHurth, KJacquier, SLueoend, RMMachauer, RRueeger, HTintelnot-Blomley, MVeenstra, SJVoegtle, M Heterocyclic derivatives and their use in the treatment of neurological disorders US Patent  US10035794 Publication Date 7/31/2018 
Target
Name:
Isocitrate dehydrogenase [NADP] cytoplasmic [R132H]
Synonyms:
Cytosolic NADP-isocitrate dehydrogenase (IDH1)(R132H) IDH1 R132H IDHC_HUMAN Isocitrate dehydrogenase 1 mutant (R132H) Isocitrate dehydrogenase [NADP] cytoplasmic (IDH1)(R132H) PICD
Type:
Protein
Mol. Mass.:
46641.74
Organism:
Homo sapiens (Human)
Description:
Human IDH1 R132H (SEQ ID No. 2 in patent). First three are removed. Google patent parsed wrong.
Residue:
414
  
Inhibitor
Name:
BDBM279663
Synonyms:
US10035794, Example 7
Type:
Small organic molecule
Emp. Form.:
C19H18F4N6O4S
Mol. Mass.:
502.443
SMILES:
[O-]C(=O)C(F)(F)F.NC(=S)c1ccc(nc1)C(=O)Nc1cccc(n1)C1(CF)COCC([NH3+])=N1
: