Target
Peptidyl-prolyl cis-trans isomerase A
Ligand
BDBM93251
Substrate
Meas. Tech.
Surface Plasmon Resonance Assay
pH
7.4±0
Temperature
298.15±0 K
Kd
2.43e+4±n/a nM
Citation
 Li, JZhang, JChen, JLuo, XZhu, WShen, JLiu, HShen, XJiang, H Strategy for discovering chemical inhibitors of human cyclophilin a: focused library design, virtual screening, chemical synthesis and bioassay. J Comb Chem 8:326-37 (2006)  
Target
Name:
Peptidyl-prolyl cis-trans isomerase A
Synonyms:
CYPA Cyclophilin A PPIA PPIase A Rotamase A
Type:
Protein
Mol. Mass.:
18015.32
Organism:
Homo sapiens (Human)
Description:
P62937
Residue:
165
  
Inhibitor
Name:
BDBM93251
Synonyms:
CypA Inhibitor, 1a
Type:
Small molecule
Emp. Form.:
C30H30ClN3O
Mol. Mass.:
484.032
SMILES:
CC(C)(C)NC(=O)[C@@H]1Cc2ccccc2CN1Cc1cc(nc2ccccc12)-c1cccc(Cl)c1
: