Target
Peptidyl-prolyl cis-trans isomerase A
Ligand
BDBM93265
Substrate
Meas. Tech.
Surface Plasmon Resonance Assay
pH
7.4±0
Temperature
298.15±0 K
IC50
9.6e+2±n/a nM
Kd
2.28e+4±n/a nM
Citation
 Li, JZhang, JChen, JLuo, XZhu, WShen, JLiu, HShen, XJiang, H Strategy for discovering chemical inhibitors of human cyclophilin a: focused library design, virtual screening, chemical synthesis and bioassay. J Comb Chem 8:326-37 (2006)  
Target
Name:
Peptidyl-prolyl cis-trans isomerase A
Synonyms:
CYPA Cyclophilin A PPIA PPIase A Rotamase A
Type:
Protein
Mol. Mass.:
18015.32
Organism:
Homo sapiens (Human)
Description:
P62937
Residue:
165
  
Inhibitor
Name:
BDBM93265
Synonyms:
CypA Inhibitor, 4f
Type:
Small molecule
Emp. Form.:
C27H18N6O5S
Mol. Mass.:
538.534
SMILES:
O=C(Nc1ccc(cc1)S(=O)(=O)Nc1ncccn1)c1ccc2nc(-c3ccco3)c(nc2c1)-c1ccco1
: